fldname,rootname,initial_exposure,net_exposure,idnum,idradec,telesc,instr,x,y,ra,dec,cnts,cnts_err,rate,rate_err,SNR,poisprob,sigmaj,sigmaj_errlow,sigmaj_errhi,sigmin,sigmin_errlow,sigmin_errhi,incang,incang_errlow,incang_errhi,offax,ext,var,N_H_gal,default_phindex,flux_elow,flux_ehi,flux,vign,spectral_fit_model,spectral_fit_nh,spectral_fit_nh_errlow,spectral_fit_nh_errhigh,spectral_fit_phindex,spectral_fit_phindex_errlow,spectral_fit_phindex_errhi,spectral_fit_chisq,spectral_fit_dof,spectral_fit_flux,flags,htmlfile,version,bgd_counts,aperture_counts,aperture_counts_err,aperture_bgd_counts,simplespatial_counts,simplespatial_bgd_counts,soft_counts,hard_counts,soft_bgd_counts,hard_bgd_counts,hr,hr_err,sscale,bscale,aperture_rate,aperture_rate_err,detx,dety
xmm0605090201,fullrun,38818.5,22442.525909,1,X035656.80-404230.3,xmm,mos1,288.860503448,265.842733333,59.2366814766,-40.7084112116,2927.21,66.9832814962,0.130431223926,0.00298465480377,94.7354608083,1.0,5.01174,4.85200940625,5.15372275,5.01174,,,0.0,,,2.45946987425,F,T,9.715052,1.8,0.3,8.0,1.14107e-12,1.0,powerlaw,536437000000.0,0.0,5.3761506156e+19,2.2376,2.1730636132,2.30322531687,207.411,170,,dsxf,fullrun_mos1_xmm0605090201_pi300-10000_pass1_cl_src1.html,0.9998,1559.55,,,,2927.21,1559.55,,,,,,,,,,,1220.87275,-39.629
xmm0605090201,fullrun,38813.2148438,30060.5375221,1,X035656.78-404230.2,xmm,mos2,288.934984828,265.867882759,59.2365627253,-40.7083808418,3687.54,77.9373466318,0.12267048849,0.00259268031884,131.66424003,1.0,4.87331,4.6964682793,4.97810509375,4.87331,,,0.0,,,2.4566296265,F,T,9.715132,1.8,0.3,8.0,1.11376e-12,1.0,powerlaw,2.9232e+13,0.0,8.29005749129e+19,2.14461,2.09275075947,2.21041336215,169.284,190,,dsxf,fullrun_mos2_xmm0605090201_pi300-10000_pass1_cl_src1.html,0.9998,2386.69,,,,3687.54,2386.69,,,,,,,,,,,-113.592577733,1002.85817452
xmm0605090201,fullrun,38813.2148438,30060.5375221,3,X035656.42-404145.9,xmm,mos2,289.858001709,275.988311768,59.2350823254,-40.6960742892,3817.78466797,75.7166976929,0.102036058903,0.00202364311554,136.314647952,1.0,10.8749996871,,,10.8749996871,,,0.0,,,1.74230692944,F,T,9.717345,1.8,0.3,8.0,9.72822e-13,1.0,powerlaw,,,,,,,,,,dbx,fullrun_mos2_xmm0605090201_pi300-10000_pass1_cl_src3.html,0.9998,102.830253601,,,,,,,,,,,,,,,,0.538168366775,605.285057729
xmm0605090201,fullrun,38818.5,22442.525909,2,X035656.43-404145.8,xmm,mos1,289.843261719,276.006225586,59.2351058125,-40.696052493,3737.44482422,77.0341415405,0.0984328091145,0.00202884245664,120.95768929,1.0,10.8749996871,,,10.8749996871,,,0.0,,,1.74147584237,F,F,9.717329,1.8,0.3,8.0,8.90329e-13,1.0,powerlaw,,,,,,,,,,dx,fullrun_mos1_xmm0605090201_pi300-10000_pass1_cl_src2.html,0.9998,157.120697021,,,,,,,,,,,,,,,,832.384515195,-150.178437048
xmm0605090201,fullrun,34195.078125,9672.94040179,1,X035656.67-404231.9,xmm,pn,289.197937012,262.477416992,59.2361371172,-40.7088729872,2323.41894531,75.7727203369,0.0679460048847,0.00221589551748,119.791119728,1.0,10.8749996871,,,10.8749996871,,,0.0,,,2.69172378249,F,T,9.715464,1.8,0.3,8.0,1.79122e-13,1.0,powerlaw,,,,,,,,,,dpbx,fullrun_pn_xmm0605090201_pi300-10000_pass1_cl_src1.html,0.9998,212.599533081,,,,,,,,,,,,,,,,168.136545182,-858.029955067
xmm0605090201,fullrun,34195.078125,9672.94040179,2,X035656.38-404146.1,xmm,pn,289.969921149,275.988034483,59.2349105737,-40.6961525387,1647.39,51.9604657408,0.170310223855,0.00537176901154,84.936336224,1.0,5.4381,5.218725,5.6981,5.4381,,,0.0,,,1.73898331852,F,F,9.717536,1.8,0.3,8.0,1.10259e-12,1.0,powerlaw,2.10487e+12,0.0,9.92145829365e+19,0.337991,0.278582111877,0.397164091729,439.092,236,,dscxf,fullrun_pn_xmm0605090201_pi300-10000_pass1_cl_src2.html,0.9998,1052.5,,,,1647.39,1052.5,,,,,,,,,,,44.8497508624,-354.583748563
xmm0605090201,fullrun,38813.2148438,30060.5375221,4,X035637.24-404134.4,xmm,mos2,340.006713867,278.769866943,59.1551619469,-40.692883111,322.851623535,25.8192443848,0.009994530119,0.00079928728519,11.5274718797,1.0,10.8749996871,,,10.8749996871,,,0.0,,,3.33409149329,F,T,9.777992,1.8,0.3,8.0,1.25162e-13,1.0,powerlaw,,,,,,,,,,dx,fullrun_mos2_xmm0605090201_pi300-10000_pass1_cl_src4.html,0.9998,96.6544418335,,,,,,,,,,,,,,,,4428.65576923,704.109615385
xmm0605090201,fullrun,38813.2148438,30060.5375221,8,X035707.02-403648.0,xmm,mos2,262.093841553,344.201416016,59.279259132,-40.6133399681,310.054168701,25.1347026825,0.00984461978078,0.000798059161752,11.0705365882,1.0,10.8749996871,,,10.8749996871,,,0.0,,,4.2368860571,F,T,9.690847,1.8,0.3,8.0,1.22923e-13,1.0,powerlaw,,,,,,,,,,dx,fullrun_mos2_xmm0605090201_pi300-10000_pass1_cl_src8.html,0.9998,96.2306594849,,,,,,,,,,,,,,,,-1218.07743363,-6065.11061947
xmm0605090201,fullrun,38818.5,22442.525909,4,X035637.24-404134.2,xmm,mos1,340.015319824,278.805114746,59.155148275,-40.6928416546,300.317504883,26.5347652435,0.00974663347006,0.000861170701683,9.71939738313,1.0,10.8749996871,,,10.8749996871,,,0.0,,,3.33356362181,F,T,9.778006,1.8,0.3,8.0,1.1445e-13,1.0,powerlaw,,,,,,,,,,dx,fullrun_mos1_xmm0605090201_pi300-10000_pass1_cl_src4.html,0.9998,146.142440796,,,,,,,,,,,,,,,,953.81122449,-4622.07653061
xmm0605090201,fullrun,38818.5,22442.525909,7,X035707.04-403647.8,xmm,mos1,262.045898438,344.453216553,59.2793353952,-40.613280999,269.881317139,24.3920898438,0.0095411753282,0.000862339045852,8.73436854297,1.0,10.8749996871,,,10.8749996871,,,0.0,,,4.25335246167,F,T,9.690794,1.8,0.3,8.0,1.19345e-13,1.0,powerlaw,,,,,,,,,,dx,fullrun_mos1_xmm0605090201_pi300-10000_pass1_cl_src7.html,0.9998,135.440093994,,,,,,,,,,,,,,,,-5907.89244186,1048.02616279
xmm0605090201,fullrun,38818.5,22442.525909,10,X035651.75-405041.5,xmm,mos1,302.057678223,152.940048218,59.2156264012,-40.8448631606,162.934188843,21.661699295,0.00805444829166,0.00107081909664,5.27315958248,0.999999857423,10.8749996871,,,10.8749996871,,,0.0,,,10.5517779028,F,F,9.719203,1.8,0.3,8.0,1.38834e-13,1.0,powerlaw,,,,,,,,,,dx,fullrun_mos1_xmm0605090201_pi300-10000_pass1_cl_src10.html,0.9998,119.366439819,,,,,,,,,,,,,,,,11131.9501779,629.825622776
xmm0605090201,fullrun,38813.2148438,30060.5375221,2,X035754.44-404637.8,xmm,mos2,138.370697021,208.352111816,59.4768233828,-40.7771701326,245.516235352,23.7755413055,0.00632558360187,0.000612563051045,8.76619875111,1.0,10.8749996871,,,10.8749996871,,,0.0,,,13.3164147209,F,F,9.52802,1.8,0.3,8.0,1.46013e-13,1.0,powerlaw,,,,,,,,,,dx,fullrun_mos2_xmm0605090201_pi300-10000_pass1_cl_src2.html,0.9998,82.4294662476,,,,,,,,,,,,,,,,-13905.748731,3594.05076142
xmm0605090201,fullrun,38813.2148438,30060.5375221,11,X035723.46-403504.2,xmm,mos2,219.022254782,368.334105747,59.3477704556,-40.584499721,100.824,19.1570352612,0.00335403028077,0.000637281563476,3.59993799032,0.999801414063,6.81127,5.27021458008,8.604498125,6.81127,,,0.0,,,7.67489042912,F,F,9.64101,1.8,0.3,8.0,5.99654e-14,1.0,powerlaw,,,,,,,,,,dsx,fullrun_mos2_xmm0605090201_pi300-10000_pass1_cl_src11.html,0.9998,266.168,,,,100.824,266.168,,,,,,,,,,,-4542.58139535,-8821.86046512
xmm0605090201,fullrun,38818.5,22442.525909,5,X035754.28-404638.4,xmm,mos1,138.782836914,208.672546387,59.4761663966,-40.7773391893,167.591278076,21.8930358887,0.00431730432851,0.000563984592106,5.42388040352,0.999999937619,10.8749996871,,,10.8749996871,,,0.0,,,13.2789823299,F,F,9.528502,1.8,0.3,8.0,8.39831e-14,1.0,powerlaw,,,,,,,,,,dx,fullrun_mos1_xmm0605090201_pi300-10000_pass1_cl_src5.html,0.9998,111.321929932,,,,,,,,,,,,,,,,3707.17777778,13697.6518519
xmm0605090201,fullrun,38813.2148438,30060.5375221,14,X035652.09-403737.6,xmm,mos2,301.188438621,333.124377011,59.2170357645,-40.6271134937,54.2289,22.5108173996,0.00180399089492,0.000748849960559,1.93625205589,0.972313089704,4.06869,2.65007994141,5.5818740625,4.06869,,,0.0,,,2.49168731683,F,F,9.736813,1.8,0.3,8.0,2.46711e-14,1.0,powerlaw,,,,,,,,,,dsx,fullrun_mos2_xmm0605090201_pi300-10000_pass1_cl_src14.html,0.9998,452.508,,,,54.2289,452.508,,,,,,,,,,,1958.03061224,-4552.71428571
xmm0605090201,fullrun,38813.2148438,30060.5375221,17,X035626.69-404514.7,xmm,mos2,367.532958984,227.583267212,59.1111934167,-40.7540782896,78.1033096313,14.0152320862,0.0039737932384,0.000713076500688,2.78869189391,0.997019894832,10.8749996871,,,10.8749996871,,,0.0,,,7.17512014715,F,F,9.805903,1.8,0.3,8.0,7.03522e-14,1.0,powerlaw,,,,,,,,,,dx,fullrun_mos2_xmm0605090201_pi300-10000_pass1_cl_src17.html,0.9998,86.8277587891,,,,,,,,,,,,,,,,5954.23952096,5496.62275449
xmm0605090201,fullrun,34195.078125,9672.94040179,3,X035534.82-404139.5,xmm,pn,503.196899414,275.776885986,58.8950854668,-40.694307571,129.315551758,18.3134059906,0.00378170072562,0.0005355567817,6.66726712138,0.999999999885,10.8749996871,,,10.8749996871,,,0.0,,,14.9357354312,F,T,9.974309,1.8,0.3,8.0,3.44976e-13,1.0,powerlaw,,,,,,,,,,dx,fullrun_pn_xmm0605090201_pi300-10000_pass1_cl_src3.html,0.9998,145.472213745,,,,,,,,,,,,,,,,-18045.9114583,-3751.09375
xmm0605090201,fullrun,34195.078125,9672.94040179,4,X035637.24-404136.8,xmm,pn,339.9972229,280.492919922,59.1551763931,-40.6935666052,389.998687744,28.2144584656,0.0114051117625,0.000825102909911,20.1076003066,1.0,10.8749996871,,,10.8749996871,,,0.0,,,3.28197898644,F,T,9.777922,1.8,0.3,8.0,4.30084e-14,1.0,powerlaw,,,,,,,,,,dpx,fullrun_pn_xmm0605090201_pi300-10000_pass1_cl_src4.html,0.9998,238.235641479,,,,,,,,,,,,,,,,-4335.03686636,-786.608294931
xmm0605090201,fullrun,38813.2148438,30060.5375221,13,X035634.22-403658.0,xmm,mos2,347.964324951,342.122741699,59.1425710697,-40.6161064291,87.0564575195,17.7538471222,0.00319154537283,0.000650867354125,3.1083655551,0.998895930775,10.8749996871,,,10.8749996871,,,0.0,,,4.78798860598,F,F,9.794018,1.8,0.3,8.0,4.71976e-14,1.0,powerlaw,,,,,,,,,,dpx,fullrun_mos2_xmm0605090201_pi300-10000_pass1_cl_src13.html,0.9998,96.4801483154,,,,,,,,,,,,,,,,6073.12737127,-4588.60162602
xmm0605090201,fullrun,38813.2148438,30060.5375221,16,X035629.74-404452.1,xmm,mos2,359.570556641,233.122161865,59.1239035749,-40.7478139088,81.7752761841,17.0968475342,0.00317305279896,0.000663393642753,2.91980008137,0.998062768078,10.8749996871,,,10.8749996871,,,0.0,,,6.48594960933,F,F,9.796857,1.8,0.3,8.0,5.00055e-14,1.0,powerlaw,,,,,,,,,,dbx,fullrun_mos2_xmm0605090201_pi300-10000_pass1_cl_src16.html,0.9998,90.3514480591,,,,,,,,,,,,,,,,5429.23699422,4917.18208092
xmm0605090201,fullrun,38818.5,22442.525909,9,X035629.42-404352.1,xmm,mos1,360.415710449,244.886352539,59.1225803311,-40.731134106,67.9110183716,15.6031713486,0.00314280483872,0.000722087919712,2.19785448239,0.985120065803,21.7499993742,,,21.7499993742,,,0.0,,,5.93838109896,T,F,9.799304,1.8,0.3,8.0,3.98094e-14,1.0,powerlaw,,,,,,,,,,dbx,fullrun_mos1_xmm0605090201_pi300-10000_pass1_cl_src9.html,0.9998,520.298217773,,,,,,,,,,,,,,,,4197.87652812,-5626.54523227
xmm0605090201,fullrun,38813.2148438,30060.5375221,5,X035557.77-404719.2,xmm,mos2,442.987335205,199.983688354,58.9907146564,-40.7886725153,115.732574463,18.3847980499,0.00298178274922,0.000473673673359,4.13225116566,0.999974905406,10.8749996871,,,10.8749996871,,,0.0,,,12.6798072095,F,F,9.893729,1.8,0.3,8.0,9.37353e-14,1.0,powerlaw,,,,,,,,,,dx,fullrun_mos2_xmm0605090201_pi300-10000_pass1_cl_src5.html,0.9998,66.0774688721,,,,,,,,,,,,,,,,12055.0431655,9038.78417266
xmm0605090201,fullrun,38813.2148438,30060.5375221,9,X035623.12-402943.3,xmm,mos2,377.157043457,441.883514404,59.0963277635,-40.4953543515,97.9191741943,17.4811096191,0.00252283080875,0.000450390664353,3.49622069312,0.999708118455,10.8749996871,,,10.8749996871,,,0.0,,,11.8629695384,F,F,9.839067,1.8,0.3,8.0,7.38904e-14,1.0,powerlaw,,,,,,,,,,dx,fullrun_mos2_xmm0605090201_pi300-10000_pass1_cl_src9.html,0.9998,76.7914199829,,,,,,,,,,,,,,,,10139.164794,-12680.8988764
xmm0605090201,fullrun,38813.2148438,30060.5375221,15,X035733.24-404856.9,xmm,mos2,193.770339966,177.15171814,59.388520426,-40.8158003687,95.5558929443,17.5301055908,0.00246194223614,0.000451653017185,3.41183933596,0.999575069153,10.8749996871,,,10.8749996871,,,0.0,,,11.6147450151,F,F,9.591384,1.8,0.3,8.0,5.03117e-14,1.0,powerlaw,,,,,,,,,,dx,fullrun_mos2_xmm0605090201_pi300-10000_pass1_cl_src15.html,0.9998,83.4591827393,,,,,,,,,,,,,,,,-9633.88474576,7218.56610169
xmm0605090201,fullrun,38813.2148438,30060.5375221,12,X035759.15-403515.9,xmm,mos2,125.562530518,366.119537354,59.4964784715,-40.587737358,91.1714859009,17.8744220734,0.0023489805281,0.000460524131931,3.25529334016,0.999309209142,10.8749996871,,,10.8749996871,,,0.0,,,13.4597294012,F,F,9.528522,1.8,0.3,8.0,5.78485e-14,1.0,powerlaw,,,,,,,,,,dx,fullrun_mos2_xmm0605090201_pi300-10000_pass1_cl_src12.html,0.9998,70.7186508179,,,,,,,,,,,,,,,,-12581.6786885,-10066.9836066
xmm0605090201,fullrun,38813.2148438,30060.5375221,10,X035632.92-403338.2,xmm,mos2,351.419708046,388.134069885,59.1371474001,-40.5606130633,50.8566,19.4265951726,0.00169180615536,0.000646249125791,1.81584351343,0.964938718852,4.92109,3.72367574219,7.17504625,4.92109,,,0.0,,,7.54359272696,F,F,9.803259,1.8,0.3,8.0,4.28944e-14,1.0,powerlaw,,,,,,,,,,dsx,fullrun_mos2_xmm0605090201_pi300-10000_pass1_cl_src10.html,0.9998,326.536,,,,50.8566,326.536,,,,,,,,,,,7120.07692308,-8509.10989011
xmm0605090201,fullrun,38818.5,22442.525909,6,X035543.55-404346.2,xmm,mos1,480.273345947,248.094512939,58.931465558,-40.7295138253,83.8525848389,17.6203327179,0.00216011914007,0.000453915857591,2.7137831808,0.996297103858,10.8749996871,,,10.8749996871,,,0.0,,,13.6790578034,F,F,9.943711,1.8,0.3,8.0,8.0398e-14,1.0,powerlaw,,,,,,,,,,dpx,fullrun_mos1_xmm0605090201_pi300-10000_pass1_cl_src6.html,0.9998,80.594581604,,,,,,,,,,,,,,,,5707.08536585,-16021.5670732
xmm0605090201,fullrun,34195.078125,9672.94040179,5,X035541.55-403455.1,xmm,pn,485.922729492,368.76348877,58.9231179434,-40.581980359,70.4784698486,16.1804828644,0.00206107059007,0.000473181631732,3.63373761624,0.999791054282,10.8749996871,,,10.8749996871,,,0.0,,,14.5175400681,F,F,9.962944,1.8,0.3,8.0,2.53853e-14,1.0,powerlaw,,,,,,,,,,dbx,fullrun_pn_xmm0605090201_pi300-10000_pass1_cl_src5.html,0.9998,173.942337036,,,,,,,,,,,,,,,,-18006.7333333,4575.46666667
xmm0605090201,fullrun,34195.078125,9672.94040179,6,X035702.73-403452.4,xmm,pn,273.310432184,371.09597931,59.2613924111,-40.5812244133,54.342,14.04798918,0.00561796994644,0.00145230541792,2.80177151924,0.996974132262,5.5186,3.71700507813,7.21421875,5.5186,,,0.0,,,5.54178526986,F,F,9.707365,1.8,0.3,8.0,2.52349e-14,1.0,powerlaw,,,,,,,,,,dsx,fullrun_pn_xmm0605090201_pi300-10000_pass1_cl_src6.html,0.9998,143.004,,,,54.342,143.004,,,,,,,,,,,-74.2317073171,8091.52439024
xmm0605090201,fullrun,34195.078125,9672.94040179,7,X035724.02-403505.9,xmm,pn,217.569641113,368.564147949,59.3500761301,-40.5849835542,132.374588013,19.0015735626,0.0038711591045,0.000555681536774,6.82498528883,0.999999999954,10.8749996871,,,10.8749996871,,,0.0,,,7.76032527839,F,T,9.639568,1.8,0.3,8.0,2.81084e-14,1.0,powerlaw,,,,,,,,,,dx,fullrun_pn_xmm0605090201_pi300-10000_pass1_cl_src7.html,0.9998,215.743728638,,,,,,,,,,,,,,,,4615.92763158,8759.91447368
xmm0605090201,fullrun,34195.078125,9672.94040179,8,X035707.03-403648.6,xmm,pn,262.075938621,344.37522069,59.2792943526,-40.6135043957,129.065,17.0270960531,0.013342928111,0.00176028604637,6.65434914304,0.999999999885,5.17029,4.273805625,5.967165,5.17029,,,0.0,,,4.24209514371,F,T,9.690876,1.8,0.3,8.0,5.34888e-14,1.0,powerlaw,,,,,,,,,,dsx,fullrun_pn_xmm0605090201_pi300-10000_pass1_cl_src8.html,0.9998,160.857,,,,129.065,160.857,,,,,,,,,,,1303.38461538,5995.25641026
xmm0605090201,fullrun,34195.078125,9672.94040179,10,X035642.87-404119.5,xmm,pn,325.274108887,282.0105896,59.1786432783,-40.6887560657,118.476257324,24.2917060852,0.00484184827656,0.000992745393887,6.10841344591,0.99999999713,10.8749996871,,,10.8749996871,,,0.0,,,2.28123085191,F,F,9.760604,1.8,0.3,8.0,1.45685e-14,1.0,powerlaw,,,,,,,,,,dx,fullrun_pn_xmm0605090201_pi300-10000_pass1_cl_src10.html,0.9998,238.227874756,,,,,,,,,,,,,,,,-3052.03370787,-349.741573034
xmm0605090201,fullrun,34195.078125,9672.94040179,11,X035656.95-404221.3,xmm,pn,288.46206665,270.898742676,59.2373094143,-40.705906759,203.127120972,39.1947555542,0.0111763039604,0.00215654354542,10.4728530846,1.0,10.8749996871,,,10.8749996871,,,0.0,,,2.12344247953,F,F,9.71483,1.8,0.3,8.0,2.85443e-14,1.0,powerlaw,,,,,,,,,,dcx,fullrun_pn_xmm0605090201_pi300-10000_pass1_cl_src11.html,0.9998,247.81854248,,,,,,,,,,,,,,,,137.508114856,-633.429463171
xmm0605090201,fullrun,34195.078125,9672.94040179,12,X035721.49-404222.5,xmm,pn,224.323248276,267.592195402,59.3395516188,-40.706238087,34.2672,13.5152210489,0.00354260151788,0.00139722657825,1.76675251195,0.960076564861,5.99552,4.37267406637,9.00631318258,2.33679,,,347.499046446,333.826128497,0.0,5.83719650371,F,F,9.637536,1.8,0.3,8.0,1.58318e-14,1.0,powerlaw,,,,,,,,,,dsx,fullrun_pn_xmm0605090201_pi300-10000_pass1_cl_src12.html,0.9998,148.394,,,,34.2672,148.394,,,,,,,,,,,5762.06122449,18.7959183673
xmm0605090201,fullrun,34195.078125,9672.94040179,13,X035651.67-405042.2,xmm,pn,302.274475098,153.094909668,59.2152800918,-40.8450623265,158.375564575,21.9922809601,0.00463153100561,0.00064314170828,8.16554683616,1.0,10.8749996871,,,10.8749996871,,,0.0,,,10.5409570945,F,F,9.719446,1.8,0.3,8.0,2.72696e-14,1.0,powerlaw,,,,,,,,,,dx,fullrun_pn_xmm0605090201_pi300-10000_pass1_cl_src13.html,0.9998,175.813034058,,,,,,,,,,,,,,,,1014.87931034,-11019.4827586
